{"text_format":"1","workbook":"xlsx","n_sheets":23,"sheets":["Cockpit","Artikeldaten","FMK-Erf.-Menü","Modellgest. FMK-Schätzung","SG-Kosten-Diagramm","LV-SG-Diagramm","Auswertung","FMK","FMK-Erf.-Auswertung","Wirkmatrix","Sensitivitätsanalyse","Sensitivität-Auswertung","Abw.-DG absolut","Berechnung","C-Wert","Werte Kennlinie","Werte 1. Abl. Kennlinie","Abw.-DG relativ","DG Kennlinie","DG 1. Ableitung","Test Regula Falsi","FMK-Erf.-Konstanten","FMK-Erf.-Erfasste Daten"],"not_rendered":{"charts":23,"images":48,"macros":1,"external_links":0,"defined_names":98,"comments":0,"pivot_tables":0},"unopened":[{"sheet":"SG-Kosten-Diagramm","index":4,"reason":"not_a_worksheet"},{"sheet":"LV-SG-Diagramm","index":5,"reason":"not_a_worksheet"},{"sheet":"Abw.-DG absolut","index":12,"reason":"not_a_worksheet"},{"sheet":"Abw.-DG relativ","index":17,"reason":"not_a_worksheet"},{"sheet":"DG Kennlinie","index":18,"reason":"not_a_worksheet"},{"sheet":"DG 1. Ableitung","index":19,"reason":"not_a_worksheet"}],"bounds":{"document_bytes":16777216,"sheet_cells":100000,"rows_first":2000,"rows_last":500,"rows_between":2000,"halvings":0,"cell_chars":16384,"cell_head_chars":4096},"cells_cut":0,"cells_raw":0,"read":"whole","date_system":"1900"}

{"sheet":"Cockpit","index":0,"n_rows":38,"n_cols":7,"rows_kept":38,"cut":false,"hidden":false,"merged":[]}
["          LoPos - Logistikkostenorientierte Bestandspositionierung"]
["Softwaredemonstrator zum IGF-Forschungsprojekt \"Fehlmengenkostenbasiertes Entscheidungsmodell der Logistik\" (16188 N)"]
[]
["© 2011 - IPH – Institut für Integrierte Produktion Hannover gemeinnützige GmbH"]
[]
["Cockpit Softwaredemonstrator"]
[]
["Rahmendaten",null,null,null,null,null,"Modus: Empirische FMK-Erfassung"]
["Länge Bezugszeitraum [d]",null,null,365]
["Lagerzinssatz [%]",null,null,0.15]
{"$rows_left_out":29}
{"sheet":"Artikeldaten","index":1,"n_rows":24,"n_cols":21,"rows_kept":24,"cut":false,"hidden":false,"merged":[[3,0,3,11],[3,13,3,20]]}
["Erfassung Artikeldaten"]
["© 2011 - IPH – Institut für Integrierte Produktion Hannover gemeinnützige GmbH"]
["Artikel","Gemessener mittlerer Lagerbestand [ME]","Gemessener Servicegrad [%]","Bestelllosgröße [ME]","Hinweis: Optimale Beschaffungslosgröße [ME]","Mittlere Bedarfsrate [ME/BKT]","Max. Bedarfsratenabweichung Produktion [ME/BKT]","Wiederbeschaffungszeit [BKT]","Maximale Verspätung Lieferant [BKT]","Max. Mengenabweichung Lieferant [ME]","Einstandspreis [GE/ME]","Mittlere Lagerabgangsgröße [ME]","Fehlmengenkosten [GE/ME]","Bestellvorgangskosten [GE]","Handlingkosten [GE/ME]","Max. Lagerbestandsabweichung [ME]","Lagerplatzkosten [GE/Platz]","Kapazität Ladehilfsmittel [ME/LHM]","Eilbeschaffungsanteil [%]","Eilbeschaffungspreis [GE/ME]","Servicegradverluste [%]"]
["Pflichtangaben",null,null,null,null,null,null,null,null,null,null,null,"Empirisch","Optionale Angaben"]
["Normteil",500,0.95,927,{"$f":"ROUNDUP(SQRT((2*Artikeldaten!F5*Cockpit!$D$9*Artikeldaten!N5)/(Artikeldaten!K5*Cockpit!$D$10+Artikeldaten!Q5*Cockpit!$D$9/(365*Artikeldaten!R5))),0)","v":927},40,60,7,7,10,0.2,40,{"$f":"VLOOKUP(A5,'FMK-Erf.-Auswertung'!$B$4:$AA$18,25,FALSE)","v":23.09},45,1,2,300,200,0.04,0.5,0]
["Komponente",123,0.85,51,{"$f":"ROUNDUP(SQRT((2*Artikeldaten!F6*Cockpit!$D$9*Artikeldaten!N6)/(Artikeldaten!K6*Cockpit!$D$10+Artikeldaten!Q6*Cockpit!$D$9/(365*Artikeldaten!R6))),0)","v":49},10,15,14,14,2,550,5,{"$f":"VLOOKUP(A6,'FMK-Erf.-Auswertung'!$B$4:$AA$18,25,FALSE)","v":91.42},45,1,1,300,5,0.02,600,0]
["Aggregat",7,0.5,7,{"$f":"ROUNDUP(SQRT((2*Artikeldaten!F7*Cockpit!$D$9*Artikeldaten!N7)/(Artikeldaten!K7*Cockpit!$D$10+Artikeldaten!Q7*Cockpit!$D$9/(365*Artikeldaten!R7))),0)","v":4},1,2,20,14,0,15000,1,{"$f":"VLOOKUP(A7,'FMK-Erf.-Auswertung'!$B$4:$AA$18,25,FALSE)","v":143.77000000000001},45,1,0,300,1,0.06,2000,0]
[null,null,null,null,null,null,null,null,null,null,null,null,{"$f":"VLOOKUP(A8,'FMK-Erf.-Auswertung'!$B$4:$AA$18,25,FALSE)","v":{"$error":"#N/A"}}]
[null,null,null,null,null,null,null,null,null,null,null,null,{"$f":"VLOOKUP(A9,'FMK-Erf.-Auswertung'!$B$4:$AA$18,25,FALSE)","v":{"$error":"#N/A"}}]
[null,null,null,null,null,null,null,null,null,null,null,null,{"$f":"VLOOKUP(A10,'FMK-Erf.-Auswertung'!$B$4:$AA$18,25,FALSE)","v":{"$error":"#N/A"}}]
{"$rows_left_out":15}
{"sheet":"FMK-Erf.-Menü","index":2,"n_rows":2,"n_cols":1,"rows_kept":2,"cut":false,"hidden":false,"merged":[]}
["           LoPos - Ereignisbezogene Fehlmengenkostenerfassung"]
["© 2011 - IPH – Institut für Integrierte Produktion Hannover gemeinnützige GmbH"]

{"sheet":"Modellgest. FMK-Schätzung","index":3,"n_rows":51,"n_cols":9,"rows_kept":51,"cut":false,"hidden":false,"merged":[[47,7,47,8],[20,8,21,9],[22,8,23,9],[24,8,25,9],[7,5,8,9]]}
["         LoPos - Modellgestützte Fehlmengenkostenabschätzung und Positionierung"]
[]
["Softwaredemonstrator zum IGF-Forschungsprojekt \"Fehlmengenkostenbasiertes Entscheidungsmodell der Logistik\" (16188 N)"]
["© 2011 - IPH – Institut für Integrierte Produktion Hannover gemeinnützige GmbH"]
[]
["Benutzermenü"]
[]
["Selektion zu analysierender Artikel",null,null,null,"Aggregat","Kostensätze Lager und Beschaffung werden aus Tabellenblatt \"Artikeldaten\" übertragen"]
[]
[]
{"$rows_left_out":42}
{"sheet":"Auswertung","index":6,"n_rows":23,"n_cols":5,"rows_kept":23,"cut":false,"hidden":false,"merged":[[3,3,3,4],[9,3,9,4],[15,3,15,4]]}
["Bestandspositionierung - Auswertung"]
["© 2011 - IPH – Institut für Integrierte Produktion Hannover gemeinnützige GmbH"]
["Artikel 1",{"$f":"Cockpit!B15","v":"Normteil"}]
[null,"Soll-Zustand","Ist-Zustand","Potenzial"]
["Servicegrad",{"$f":"Berechnung!A24","v":1.0000000000000007},{"$f":"VLOOKUP($B$3,Artikeldaten!$A$5:$C$24,3,FALSE)","v":0.95},{"$f":"$B$5-$C$5","v":5.0000000000000711E-2},{"$f":"IF(D5>=0,\"Erhöhung möglich\",\"Senkung möglich\")","v":"Erhöhung möglich"}]
["Logistikkosten [€]",{"$f":"Berechnung!B24","v":4644.4577025651852},{"$f":"Berechnung!C23","v":20860.397006232433},{"$f":"$C$6-$B$6","v":16215.939303667248},{"$f":"IF(D6>=0,\"Senkung möglich\",\"Erhöhung möglich\")","v":"Senkung möglich"}]
["Lagerbestand [ME]",{"$f":"Berechnung!C24","v":776.71558071079414},{"$f":"VLOOKUP($B$3,Artikeldaten!$A$5:$C$24,2,FALSE)","v":500},{"$f":"$C$7-$B$7","v":-276.71558071079414},{"$f":"IF(D7>=0,\"Senkung möglich\",\"Erhöhung möglich\")","v":"Erhöhung möglich"}]
[]
["Artikel 2",{"$f":"Cockpit!B17","v":"Komponente"}]
[null,"Soll-Zustand","Ist-Zustand","Potenzial"]
{"$rows_left_out":14}
{"sheet":"FMK","index":7,"n_rows":10,"n_cols":14,"rows_kept":10,"cut":false,"hidden":false,"merged":[[2,2,2,7],[2,8,2,13]]}
["Fehlmengenkosten - Auswertung"]
["© 2011 - IPH – Institut für Integrierte Produktion Hannover gemeinnützige GmbH"]
[null,null,"Absolut",null,null,null,null,null,"Prozentual"]
[null,"Bezeichnung","Produktionsunterbrechungskosten","Dispositionkosten","Kapitalbindungskosten","Leerkosten","Losgrößenabweichungskosten","Summe","Produktionsunterbrechungskosten","Dispositionkosten","Kapitalbindungskosten","Leerkosten","Losgrößenabweichungskosten","Summe"]
["Artikel 1",{"$f":"Cockpit!B15","v":"Normteil"},{"$f":"VLOOKUP($B5,'FMK-Erf.-Auswertung'!$B$4:$AA$16,3,FALSE)","v":18.75},{"$f":"VLOOKUP($B5,'FMK-Erf.-Auswertung'!$B$4:$AA$16,5,FALSE)","v":25},{"$f":"VLOOKUP($B5,'FMK-Erf.-Auswertung'!$B$4:$AA$16,7,FALSE)","v":44.5},{"$f":"VLOOKUP($B5,'FMK-Erf.-Auswertung'!$B$4:$AA$16,9,FALSE)","v":47.5},{"$f":"VLOOKUP($B5,'FMK-Erf.-Auswertung'!$B$4:$AA$16,11,FALSE)","v":0},{"$f":"SUM(C5:G5)","v":135.75},{"$f":"C$5/$H5","v":0.13812154696132597},{"$f":"D$5/$H5","v":0.18416206261510129},0.32780847145488029,0.34990791896869244,0,{"$f":"SUM(I5:M5)","v":1}]
["Artikel 2",{"$f":"Cockpit!B17","v":"Komponente"},{"$f":"VLOOKUP($B6,'FMK-Erf.-Auswertung'!$B$4:$AA$16,3,FALSE)","v":62.22},{"$f":"VLOOKUP($B6,'FMK-Erf.-Auswertung'!$B$4:$AA$16,5,FALSE)","v":25},{"$f":"VLOOKUP($B6,'FMK-Erf.-Auswertung'!$B$4:$AA$16,7,FALSE)","v":41.78},{"$f":"VLOOKUP($B6,'FMK-Erf.-Auswertung'!$B$4:$AA$16,9,FALSE)","v":63.89},{"$f":"VLOOKUP($B6,'FMK-Erf.-Auswertung'!$B$4:$AA$16,11,FALSE)","v":0},{"$f":"SUM(C6:G6)","v":192.89},{"$f":"C$6/$H6","v":0.32256726631759036},{"$f":"D$6/$H6","v":0.12960754834361554},0.21660013479185031,0.3312250505469439,0,{"$f":"SUM(I6:M6)","v":1}]
["Artikel 3",{"$f":"Cockpit!B19","v":"Aggregat"},{"$f":"VLOOKUP($B7,'FMK-Erf.-Auswertung'!$B$4:$AA$16,3,FALSE)","v":39.44},{"$f":"VLOOKUP($B7,'FMK-Erf.-Auswertung'!$B$4:$AA$16,5,FALSE)","v":19.440000000000001},{"$f":"VLOOKUP($B7,'FMK-Erf.-Auswertung'!$B$4:$AA$16,7,FALSE)","v":45.44},{"$f":"VLOOKUP($B7,'FMK-Erf.-Auswertung'!$B$4:$AA$16,9,FALSE)","v":50.71},{"$f":"VLOOKUP($B7,'FMK-Erf.-Auswertung'!$B$4:$AA$16,11,FALSE)","v":0},155.03,{"$f":"C$7/$H7","v":0.25440237373411595},{"$f":"D$7/$H7","v":0.12539508482229247},0.29310456040766303,0.32709798103592852,0,1]
[]
[{"$f":"Cockpit!C15","v":"Rang 3 von 3"},null,null,null,{"$f":"Cockpit!C17","v":"Rang 2 von 3"},null,null,null,null,{"$f":"Cockpit!C19","v":"Rang 1 von 3"}]
[{"$f":"B5","v":"Normteil"},null,null,null,{"$f":"B6","v":"Komponente"},null,null,null,null,{"$f":"B7","v":"Aggregat"}]
{"$rows_left_out":1}
{"sheet":"FMK-Erf.-Auswertung","index":8,"n_rows":6,"n_cols":32,"rows_kept":6,"cut":false,"hidden":false,"merged":[[0,31,2,31],[0,29,1,30],[1,3,1,4],[1,5,1,6],[1,7,1,8],[1,9,1,10],[1,19,1,20],[1,21,1,22],[0,0,2,0],[0,1,2,1],[0,2,1,2],[0,27,1,28],[0,3,0,14],[0,15,0,26],[1,15,1,16],[1,17,1,18],[1,23,1,24],[1,25,1,26],[1,11,1,12],[1,13,1,14]]}
["Rang","Artikel","Betroffenes","Summe aller Fehlmengenereignisse",null,null,null,null,null,null,null,null,null,null,null,"Kosten pro Bezugsgröße",null,null,null,null,null,null,null,null,null,null,null,"Fehldauer",null,"Fehlmenge",null,"Einheit"]
[null,null,null,"KUnterbr [€]",null,"Kdispo [€]",null,"Kkap [€]",null,"Kleer [€]",null,"Klos,abw [€]",null,"Kfehl [€]",null,"KUnterbr [€/Stk]",null,"Kdispo [€/Stk]",null,"Kkap [€/Stk]",null,"Kleer [€/Stk]",null,"Klos,abw [€/Stk]",null,"Kfehl [€/Stk]"]
[null,null,"Arbeitssystem","μ","σ","μ","σ","μ","σ","μ","σ","μ","σ","μ","σ","μ","σ","μ","σ","μ","σ","μ","σ","μ","σ","μ","σ","μ","σ","μ","σ"]
[1,"Aggregat","Montagebereich02",39.44,22.84,19.440000000000001,11.02,45.44,23.02,50.71,5.35,0,0,143.77000000000001,78.44,39.44,22.84,19.440000000000001,11.02,45.44,23.02,50.71,5.35,0,0,143.77000000000001,78.44,5.1100000000000003,1.76,1,0,"Stück"]
[2,"Komponente","Montagebereich01",62.22,16.03,25,0,41.78,18.25,63.89,19.649999999999999,0,0,192.89,49.23,29.49,7.6,11.85,0,19.8,8.65,30.28,9.31,0,0,91.42,23.33,6,2.12,2.11,0.93,"Stück"]
[3,"Normteil","Montagebereich01",18.75,25.88,25,0,44.5,18.600000000000001,47.5,10.35,0,0,135.75,47.93,3.19,4.4000000000000004,4.25,0,7.57,3.16,8.08,1.76,0,0,23.09,8.15,2.38,1.41,5.88,4.05,"Stück"]

{"sheet":"Wirkmatrix","index":9,"n_rows":58,"n_cols":19,"rows_kept":58,"cut":false,"hidden":false,"merged":[[48,4,49,4],[48,5,49,5],[51,4,54,4],[51,5,54,5],[55,4,57,4],[55,5,57,5],[43,1,44,1],[43,4,44,4],[43,5,44,5],[45,4,47,4],[45,5,47,5],[46,1,47,1],[36,1,37,1],[36,4,37,4],[36,5,37,5],[40,1,41,1],[40,4,41,4],[40,5,41,5],[29,4,30,4],[29,5,30,5],[31,1,32,1],[34,1,35,1],[34,4,35,4],[34,5,35,5],[20,1,22,1],[20,4,22,4],[20,5,22,5],[23,4,25,4],[23,5,25,5],[26,4,28,4],[26,5,28,5],[12,4,13,4],[12,5,13,5],[14,4,15,4],[14,5,15,5],[16,4,18,4],[16,5,18,5],[10,1,11,1],[10,4,11,4],[10,5,11,5],[3,6,3,17],[4,6,4,7],[4,8,4,9],[7,4,9,4],[7,5,9,5]]}
[]
[null,"Matrix – Zusammenhang betriebliche und externe Einflussgrößen auf FMK-Entstehung und FMK-Höhe"]
[]
[null,"Bestandteile der Fehlmengenkostenfunktion",null,null,null,null,"Identifizierte Fehlmengenkostenarten"]
[null,null,null,null,null,null,"Betriebsunter-brechungs-kosten",null,"Leerkosten"]
[null,null,null,null,null,null,"Stillstandskosten","Übergangskosten","Betriebsmittel","Personal","Losgrößenabweichungskosten","Kapitalbindungskosten","Dispositionskosten","Konventionalstrafen, Schadenersatz","Umsatzverluste","Eilfrachtkosten","Erhöhte Einstandspreise","Zusätzlicher Personalaufwand über Disposition hinaus"]
[null,"Klassifizierung Einflussgröße","Wirkung auf Höhe FMK-Arten","Einflussfaktoren auf Einflussgröße","Erfassbare Einflussgröße","Quantifizierbare Kostentreiber",null,null,null,null,null,null,null,null,null,null,null,null,"Anzahl beeinflusste Kostenarten"]
[null,"Technologie","+","Verkettungsgrad von Arbeitssystemen","Anzahl von Fehlmengenereignis betroffener Arbeitssysteme","nunterbr",1,1,1,1,1,1,1,null,null,null,null,null,{"$f":"SUM(G8:R8)","v":7}]
[null,"Produkt","+","Verwendungshäufigkeit fehlender Artikel in Produkten des Unternehmens",null,null,1,1,1,1,1,1,1,null,null,null,null,null,{"$f":"SUM(G9:R9)","v":7}]
[null,"Organisation","–","Pufferbestandshöhe zwischen Arbeitssystemen",null,null,1,1,1,1,1,1,1,null,null,null,null,null,7]
{"$rows_left_out":49}
{"sheet":"Sensitivitätsanalyse","index":10,"n_rows":27,"n_cols":11,"rows_kept":27,"cut":false,"hidden":false,"merged":[[24,1,24,5],[0,0,0,10],[4,4,4,6],[7,0,11,0],[12,0,15,0],[16,0,19,0],[20,0,22,0]]}
["LoPos - Logistikkostenorientierte Positionierung \ndes Lager-Servicegrads - SENSITIVITÄTSANALYSE"]
["© 2011 - IPH – Institut für Integrierte Produktion Hannover gemeinnützige GmbH"]
[null,"Bezugs-zeitraum",{"$f":"Cockpit!D9","v":365},"BKT",null,null,null,null,null,null,"BR_m"]
[]
[null,null,null,null,"Ausprägung"]
[null,"Parameter","Einheit","Bedeutung",{"$f":"Cockpit!B15","v":"Normteil"},{"$f":"Cockpit!B17","v":"Komponente"},{"$f":"Cockpit!B19","v":"Aggregat"},"Untere Grenze","Obere Grenze","Schritt-weite"]
["Allgemeine Parameter","BR_m","ME/ZE","Mittlere Bedarfsrate",{"$f":"VLOOKUP($E$6,Artikeldaten!$A$5:$U$24,6,FALSE)","v":40},{"$f":"VLOOKUP($F$6,Artikeldaten!$A$5:$U$24,6,FALSE)","v":10},{"$f":"VLOOKUP($G$6,Artikeldaten!$A$5:$U$24,6,FALSE)","v":1},-0.5,1,0.02]
["Parameter der Beschaffung","X_zu,m","ME","Beschaffungslosgröße",{"$f":"VLOOKUP($E$6,Artikeldaten!$A$5:$U$24,4,FALSE)","v":927},{"$f":"VLOOKUP($F$6,Artikeldaten!$A$5:$U$24,4,FALSE)","v":51},{"$f":"VLOOKUP($G$6,Artikeldaten!$A$5:$U$24,4,FALSE)","v":7},-0.5,1,0.02]
[null,"p_st","GE/ME","Einstandspreis",{"$f":"VLOOKUP($E$6,Artikeldaten!$A$5:$U$24,11,FALSE)","v":0.2},{"$f":"VLOOKUP($F$6,Artikeldaten!$A$5:$U$24,11,FALSE)","v":550},{"$f":"VLOOKUP($G$6,Artikeldaten!$A$5:$U$24,11,FALSE)","v":15000},-0.5,100,0.5]
[null,"k_best","GE","Bestellvorgangskostensatz",{"$f":"VLOOKUP($E$6,Artikeldaten!$A$5:$U$24,14,FALSE)","v":45},{"$f":"VLOOKUP($F$6,Artikeldaten!$A$5:$U$24,14,FALSE)","v":45},{"$f":"VLOOKUP($G$6,Artikeldaten!$A$5:$U$24,14,FALSE)","v":45},-0.5,1,0.02]
{"$rows_left_out":18}
{"sheet":"Sensitivität-Auswertung","index":11,"n_rows":86,"n_cols":13,"rows_kept":86,"cut":false,"hidden":false,"merged":[[8,11,8,12],[2,1,2,3],[8,1,8,2],[8,3,8,4],[8,5,8,6],[8,7,8,8],[8,9,8,10]]}
["Auswertung Sensitivitätsanalyse"]
[]
["Parameter","BR_m"]
[]
["Ausgangswert","Artikel 1","Artikel 2","Artikel 3"]
["SG_opt",1,1,1]
["K_log,sgopt",942.71983848751506,22332.553957212727,62256.933640241878]
[]
["Analyse","Artikel 1",null,"Artikel 2",null,"Artikel 3",null,"Δ Artikel 1",null,"Δ Artikel 2",null,"Δ Artikel 3"]
["Abweichung","SG_opt","K_log,sgopt","SG_opt","K_log,sgopt","SG_opt","K_log,sgopt","Δ SG_opt","Δ K_log,sgopt","Δ SG_opt","Δ K_log,sgopt","Δ SG_opt","Δ K_log,sgopt"]
{"$rows_left_out":77}
{"sheet":"Berechnung","index":13,"n_rows":1026,"n_cols":19,"rows_kept":1026,"cut":false,"hidden":false,"merged":[[0,0,0,8],[1,0,1,8],[0,10,0,18],[1,10,1,18]]}
["Berechnungstabelle - Empirisch erfasste FMK",null,null,null,null,null,null,null,null,null,"Berechnungstabelle - Modellgestützt abgeschätzte FMK"]
["Tabelleninhalt nicht verändern!",null,null,null,null,null,null,null,null,null,"Tabelleninhalt nicht verändern!"]
["Artikel 1",{"$f":"Cockpit!B15","v":"Normteil"},null,"Artikel 2",{"$f":"Cockpit!B17","v":"Komponente"},null,"Artikel 3",{"$f":"Cockpit!B19","v":"Aggregat"},null,null,"Artikel",{"$f":"'Modellgest. FMK-Schätzung'!E8","v":"Aggregat"}]
["BR_m",{"$f":"VLOOKUP($B$3,Artikeldaten!$A$5:$U$24,6,FALSE)","v":40},{"$f":"\"Positionierung \" & B3","v":"Positionierung Normteil"},"BR_m2",{"$f":"VLOOKUP($E$3,Artikeldaten!$A$5:$U$24,6,FALSE)","v":10},{"$f":"\"Positionierung \" & E3","v":"Positionierung Komponente"},"BR_m3",{"$f":"VLOOKUP($H$3,Artikeldaten!$A$5:$U$24,6,FALSE)","v":1},{"$f":"\"Positionierung \" & H3","v":"Positionierung Aggregat"},1,"BR_m",{"$f":"VLOOKUP($L$3,Artikeldaten!$A$5:$U$24,6,FALSE)","v":1}]
["T",{"$f":"Cockpit!$D$9","v":365},null,"T_2",{"$f":"Cockpit!$D$9","v":365},null,"T_3",{"$f":"Cockpit!$D$9","v":365},null,null,"T",{"$f":"Cockpit!$D$9","v":365}]
["p_st",{"$f":"VLOOKUP($B$3,Artikeldaten!$A$5:$U$24,11,FALSE)","v":0.2},null,"p_st2",{"$f":"VLOOKUP($E$3,Artikeldaten!$A$5:$U$24,11,FALSE)","v":550},null,"p_st3",{"$f":"VLOOKUP($H$3,Artikeldaten!$A$5:$U$24,11,FALSE)","v":15000},null,null,"p_st",{"$f":"VLOOKUP($L$3,Artikeldaten!$A$5:$U$24,11,FALSE)","v":15000}]
["k_best",{"$f":"VLOOKUP($B$3,Artikeldaten!$A$5:$U$24,14,FALSE)","v":45},null,"k_best2",{"$f":"VLOOKUP($E$3,Artikeldaten!$A$5:$U$24,14,FALSE)","v":45},null,"k_best3",{"$f":"VLOOKUP($H$3,Artikeldaten!$A$5:$U$24,14,FALSE)","v":45},null,null,"k_best",{"$f":"VLOOKUP($L$3,Artikeldaten!$A$5:$U$24,14,FALSE)","v":45}]
["k_hand",{"$f":"VLOOKUP($B$3,Artikeldaten!$A$5:$U$24,15,FALSE)","v":1},null,"k_hand2",{"$f":"VLOOKUP($E$3,Artikeldaten!$A$5:$U$24,15,FALSE)","v":1},null,"k_hand3",{"$f":"VLOOKUP($H$3,Artikeldaten!$A$5:$U$24,15,FALSE)","v":1},null,null,"k_hand",{"$f":"VLOOKUP($L$3,Artikeldaten!$A$5:$U$24,15,FALSE)","v":1}]
["kap_lhm",{"$f":"VLOOKUP($B$3,Artikeldaten!$A$5:$U$24,18,FALSE)","v":200},null,"kap_lhm2",{"$f":"VLOOKUP($E$3,Artikeldaten!$A$5:$U$24,18,FALSE)","v":5},null,"kap_lhm3",{"$f":"VLOOKUP($H$3,Artikeldaten!$A$5:$U$24,18,FALSE)","v":1},null,null,"kap_lhm",{"$f":"VLOOKUP($L$3,Artikeldaten!$A$5:$U$24,18,FALSE)","v":1}]
["ta",{"$f":"VLOOKUP($B$3,Artikeldaten!$A$5:$U$24,9,FALSE)","v":7},null,"ta_2",{"$f":"VLOOKUP($E$3,Artikeldaten!$A$5:$U$24,9,FALSE)","v":14},null,"ta3",{"$f":"VLOOKUP($H$3,Artikeldaten!$A$5:$U$24,9,FALSE)","v":14},null,null,"ta",{"$f":"VLOOKUP($L$3,Artikeldaten!$A$5:$U$24,9,FALSE)","v":14}]
{"$rows_left_out":1017}
{"sheet":"C-Wert","index":14,"n_rows":33,"n_cols":20,"rows_kept":33,"cut":false,"hidden":false,"merged":[]}
["Berechnung des C-Werts"]
[]
["© 2011 - IPH – Institut für Integrierte Produktion Hannover gemeinnützige GmbH"]
[]
["Artikel 1 - empirischer FMK-Satz",null,null,null,null,"Artikel 2 - empirischer FMK-Satz",null,null,null,null,"Artikel 3 - empirischer FMK-Satz",null,null,null,null,"Artikel - Modellgestützte FMK-Abschätzung"]
[{"$f":"Cockpit!$B$15","v":"Normteil"},null,null,null,null,{"$f":"Cockpit!$B$17","v":"Komponente"},null,null,null,null,{"$f":"Cockpit!$B$19","v":"Aggregat"},null,null,null,null,{"$f":"'Modellgest. FMK-Schätzung'!E8","v":"Aggregat"}]
["C-Wert",{"$f":"VLOOKUP(1,A15:B33,2,FALSE)","v":1.1176202310412831E-2},null,null,null,"C-Wert",{"$f":"VLOOKUP(1,F15:G33,2,FALSE)","v":133682148.14583272},null,null,null,"C-Wert",{"$f":"VLOOKUP(1,K15:L33,2,FALSE)","v":0.48322521536015739},null,null,null,"C-Wert",{"$f":"VLOOKUP(1,P15:Q33,2,FALSE)","v":0.48322521536015739}]
["BL_1",{"$f":"Berechnung!B21","v":145176},null,null,null,"BL_1",{"$f":"BL_1","v":3992},null,null,null,"BL_1",{"$f":"BL_3","v":86},null,null,null,"BL_1",{"$f":"BL_1_mod","v":86}]
["BL_0",{"$f":"X_zu_m*0.5","v":463.5},null,null,null,"BL_0",{"$f":"X_zu_m2*0.5","v":25.5},null,null,null,"BL_0",{"$f":"X_zu_m3*0.5","v":3.5},null,null,null,"BL_0",{"$f":"X_zu_m_mod*0.5","v":3.5}]
["BL_m",{"$f":"VLOOKUP($A$6,Artikeldaten!$A$5:$U$24,2,FALSE)","v":500},null,null,null,"BL_m",{"$f":"VLOOKUP($F$6,Artikeldaten!$A$5:$U$24,2,FALSE)","v":123},null,null,null,"BL_m",{"$f":"VLOOKUP($K$6,Artikeldaten!$A$5:$U$24,2,FALSE)","v":7},null,null,null,"BL_m",{"$f":"VLOOKUP($P$6,Artikeldaten!$A$5:$U$24,2,FALSE)","v":7}]
{"$rows_left_out":24}
{"sheet":"Werte Kennlinie","index":15,"n_rows":106,"n_cols":4,"rows_kept":106,"cut":false,"hidden":false,"merged":[[4,1,4,3]]}
["Verlauf Servicegrad-Logistikkosten-Kennlinie"]
[]
["Schrittweite",0.01]
[]
[null,"Resultierende Logistikkosten"]
["SG","Artikel 1","Artikel 2","Artikel 3"]
[0,323921.44,370809.34,93127.486999999994]
[0.01,321148.42809610709,379305.16121927416,92818.746816402418]
[0.02,317915.39923095983,377355.82126282045,92510.007332804831]
[0.03,314679.25215721136,374766.76309078676,92201.268549207249]
{"$rows_left_out":97}
{"sheet":"Werte 1. Abl. Kennlinie","index":16,"n_rows":106,"n_cols":4,"rows_kept":106,"cut":false,"hidden":false,"merged":[[4,1,4,3]]}
["Verlauf Kennlinienableitungen"]
[]
["Schrittweite",0.01]
[]
[null,"Wert der 1. Ableitung"]
["SG","Artikel 1","Artikel 2","Artikel 3"]
[0,-350546,-1752730,-17527300]
[0.01,-350517.35250570282,-1752678.1255705412,-17527133.315768458]
[0.02,-350479.36990607542,-1752625.5844052983,-17526959.964284316]
[0.03,-350432.70087908633,-1752572.4228344196,-17526780.408841737]
{"$rows_left_out":97}
{"sheet":"Test Regula Falsi","index":20,"n_rows":373,"n_cols":10,"rows_kept":373,"cut":false,"hidden":false,"merged":[]}
["Bestimmung des optimalen Servicegrads - Regula Falsi"]
[]
["Startwerte"]
["x_m",0.999,"x_t",36500,"s_besch",150.74,"sb_ges",1981,"C-Wert",0.35]
["x_n",1E-3,"s_lager",82.5,"s_fehl",14.8,"x_zu,m",300]
[]
["n","x_m","x_n","x_n - x_m","f(x_n)","f(x_m)","f(x_n) - f(x_m)"]
[0,{"$f":"B4","v":0.999},{"$f":"B5","v":1E-3},{"$f":"C8-B8","v":-0.998},{"$f":"$D$5*($H$5*C8+$H$4*((1-(1-C8)^$J$4)^((1-$J$4)/$J$4))*((1-C8)^($J$4-1)))-$D$4*$F$5","v":-540175.18752248609},{"$f":"$D$5*($H$5*B8+$H$4*((1-(1-B8)^$J$4)^((1-$J$4)/$J$4))*((1-B8)^($J$4-1)))-$D$4*$F$5","v":11732026.954822803},{"$f":"E8-F8","v":-12272202.142345289}]
[1,{"$f":"B8","v":0.999},{"$f":"C8-(((C8-B8)*E8)/G8)","v":4.4928125604066768E-2},{"$f":"C9-B9","v":-0.95407187439593322},{"$f":"$D$5*($H$5*C9+$H$4*((1-(1-C9)^$J$4)^((1-$J$4)/$J$4))*((1-C9)^($J$4-1)))-$D$4*$F$5","v":-539010.56388649438},{"$f":"$D$5*($H$5*B9+$H$4*((1-(1-B9)^$J$4)^((1-$J$4)/$J$4))*((1-B9)^($J$4-1)))-$D$4*$F$5","v":11732026.954822803},{"$f":"E9-F9","v":-12271037.518709298}]
[2,0.999,{"$f":"C9-(((C9-B9)*E9)/G9)","v":8.6836140164557429E-2},{"$f":"C10-B10","v":-0.91216385983544257},{"$f":"$D$5*($H$5*C10+$H$4*((1-(1-C10)^$J$4)^((1-$J$4)/$J$4))*((1-C10)^($J$4-1)))-$D$4*$F$5","v":-537772.29952627735},{"$f":"$D$5*($H$5*B10+$H$4*((1-(1-B10)^$J$4)^((1-$J$4)/$J$4))*((1-B10)^($J$4-1)))-$D$4*$F$5","v":11732026.954822803},{"$f":"E10-F10","v":-12269799.254349081}]
{"$rows_left_out":364}
{"sheet":"FMK-Erf.-Konstanten","index":21,"n_rows":4,"n_cols":12,"rows_kept":4,"cut":false,"hidden":false,"merged":[[0,10,0,11],[0,0,1,0],[0,9,1,9],[0,5,0,6],[0,1,0,4],[0,7,0,8]]}
["Maschine","Kostensätze",null,null,null,"Kosten",null,"Anzahl Arbeiter",null,"Kapitalbindungssatz","losgrößenabhängige Rüstkosten"]
[null,"laufende Stillstandskosten","Personalkostensatz","gleiche Entlohnung","Maschinenstundensatz","Stillsetzungskosten","Wiederanlaufkosten","Anzahl Arbeiter","statisch",null,"Umrüstkosten(zeitlich)","Einzelrüstkosten"]
["Montagebereich01",23.5,20,true,32.5,17.5,19.5,3,true,0.125,13.125,25]
["Montagebereich02",28,20,true,35,35,42,5,true,null,11,20]

{"sheet":"FMK-Erf.-Erfasste Daten","index":22,"n_rows":28,"n_cols":12,"rows_kept":28,"cut":false,"hidden":false,"merged":[[0,11,1,11],[0,0,1,0],[0,1,1,1],[0,10,1,10],[0,6,1,6],[0,7,1,7],[0,8,1,8],[0,9,1,9],[0,2,1,2],[0,3,1,3],[0,4,1,4]]}
["Datum & Uhrzeit","Artikel","Fehlmenge","Einheit","Fehldauer","Betroffenes","KUnterbr [€]","Kdispo [€]","Kkap [€]","Kleer [€]","Klos,abw [€]","Kfehl [€]"]
[null,null,null,null,null,"Arbeitssystem"]
["2010-07-01","Normteil",10,"Stück",1,"Montagebereich01",0,25,40,35,0,100]
["2010-07-03","Normteil",8,"Stück",1,"Montagebereich01",0,25,35,35,0,95]
["2010-08-01","Normteil",2,"Stück",1,"Montagebereich01",0,25,23,35,0,83]
["2010-08-15","Normteil",5,"Stück",2,"Montagebereich01",0,25,34,55,0,114]
["2010-08-16","Normteil",2,"Stück",2,"Montagebereich01",0,25,45,55,0,125]
["2010-08-17","Normteil",7,"Stück",4,"Montagebereich01",50,25,67,55,0,197]
["2010-09-19","Normteil",1,"Stück",4,"Montagebereich01",50,25,34,55,0,164]
["2010-08-19","Normteil",12,"Stück",4,"Montagebereich01",50,25,78,55,0,208]
{"$rows_left_out":18}